Target
Muscarinic acetylcholine receptor M1
Ligand
BDBM50107703
Substrate
Meas. Tech.
ChEMBL_138408 (CHEMBL744770)
Ki
1.5±n/a nM
Citation
 Rajeswaran, WGCao, YHuang, XPWroblewski, MEColclough, TLee, SLiu, FNagy, PIEllis, JLevine, BANocka, KHMesser, WS Design, synthesis, and biological characterization of bivalent 1-methyl-1,2,5,6-tetrahydropyridyl-1,2,5-thiadiazole derivatives as selective muscarinic agonists. J Med Chem 44:4563-76 (2001)  
Target
Name:
Muscarinic acetylcholine receptor M1
Synonyms:
ACM1_HUMAN Cholinergic receptor, muscarinic 1 | Cholinergic, muscarinic M1
Type:
Protein
Mol. Mass.:
51442.54
Organism:
Homo sapiens (Human)
Description:
P11229
Residue:
460
  
Inhibitor
Name:
BDBM50107703
Synonyms:
1-[4-(1-methyl-1,2,3,6-tetrahydro-5-pyridinyl)-1,2,5-thiadiazol-3-yloxy]-2-{2-[2-(2-{2-[4-(1-methyl-1,2,3,6-tetrahydro-5-pyridinyl)-1,2,5-thiadiazol-3-yloxy]ethoxy}ethoxy)ethoxy]ethoxy}ethane | CHEMBL140142
Type:
Small organic molecule
Emp. Form.:
C26H40N6O6S2
Mol. Mass.:
596.762
SMILES:
CN1CCC=C(C1)c1nsnc1OCCOCCOCCOCCOCCOc1nsnc1C1=CCCN(C)C1
: