Target
Hemagglutinin
Ligand
BDBM50551836
Substrate
Meas. Tech.
ChEMBL_2032416 (CHEMBL4686574)
IC50
12000±n/a nM
Citation
 de Castro, SGinex, TVanderlinden, ELaporte, MStevaert, ACumella, JGago, FCamarasa, MJLuque, FJNaesens, LVelazquez, S N-benzyl 4,4-disubstituted piperidines as a potent class of influenza H1N1 virus inhibitors showing a novel mechanism of hemagglutinin fusion peptide interaction. Eur J Med Chem 194:0 (2020)  
Target
Name:
Hemagglutinin
Synonyms:
HA | HEMA_I34A1
Type:
PROTEIN
Mol. Mass.:
63355.67
Organism:
Influenza A virus (strain A/Puerto Rico/8/1934 H1N1)
Description:
ChEMBL_795514
Residue:
565
  
Inhibitor
Name:
BDBM50551836
Synonyms:
CHEMBL3288937
Type:
Small organic molecule
Emp. Form.:
C37H45FN4O6
Mol. Mass.:
660.7748
SMILES:
COC(=O)C[C@H](NC(=O)OC(C)(C)C)C(=O)N(Cc1ccc(F)cc1)C1(CCN(Cc2ccccc2)CC1)C(=O)NCc1ccccc1
: