Target
Bone morphogenetic protein 1
Ligand
BDBM50111816
Substrate
Meas. Tech.
ChEBML_158892
IC50
110±n/a nM
Citation
 Dankwardt, SMAbbot, SCBroka, CAMartin, RLChan, CSSpringman, EBVan Wart, HEWalker, KA Amino acid derived sulfonamide hydroxamates as inhibitors of procollagen C-proteinase. Part 2: Solid-phase optimization of side chains. Bioorg Med Chem Lett 12:1233-5 (2002)  
Target
Name:
Bone morphogenetic protein 1
Synonyms:
BMP-1 BMP1_HUMAN PCOLC Procollagen C-proteinase | mTld
Type:
PROTEIN
Mol. Mass.:
111254.03
Organism:
Homo sapiens (Human)
Description:
ChEMBL_518962
Residue:
986
  
Inhibitor
Name:
BDBM50111816
Synonyms:
4-{[((R)-1-Hydroxycarbamoyl-2-thiophen-2-yl-ethyl)-(4-methoxy-benzenesulfonyl)-amino]-methyl}-benzoic acid methyl ester | CHEMBL20409
Type:
Small organic molecule
Emp. Form.:
C23H24N2O7S2
Mol. Mass.:
504.576
SMILES:
COC(=O)c1ccc(CN([C@H](Cc2cccs2)C(=O)NO)S(=O)(=O)c2ccc(OC)cc2)cc1
: