Target
cAMP-specific 3',5'-cyclic phosphodiesterase 4A
Ligand
BDBM50113396
Substrate
Meas. Tech.
ChEBML_155041
IC50
8±n/a nM
Citation
 Alexander, RPWarrellow, GJEaton, MABoyd, ECHead, JCPorter, JRBrown, JAReuberson, JTHutchinson, BTurner, PBoyce, BBarnes, DMason, BCannell, ATaylor, RJZomaya, AMillican, ALeonard, JMorphy, RWales, MPerry, MAllen, RAGozzard, NHughes, BHiggs, G CDP840. A prototype of a novel class of orally active anti-inflammatory phosphodiesterase 4 inhibitors. Bioorg Med Chem Lett 12:1451-6 (2002)  
Target
Name:
cAMP-specific 3',5'-cyclic phosphodiesterase 4A
Synonyms:
3',5'-cyclic phosphodiesterase PDE46 PDE4A_HUMAN Phosphodiesterase 4A | Phosphodiesterase 4A (PDE4)
Type:
Enzyme
Mol. Mass.:
98113.27
Organism:
Homo sapiens (Human)
Description:
P27815
Residue:
886
  
Inhibitor
Name:
BDBM50113396
Synonyms:
4-[(R)-2-(3-cyclopentyloxy-4-methoxy-phenyl)-2-pyridin-4-yl-ethyl]-pyridine | CHEMBL36007
Type:
Small organic molecule
Emp. Form.:
C24H26N2O2
Mol. Mass.:
374.4754
SMILES:
COc1ccc(cc1OC1CCCC1)[C@H](Cc1ccncc1)c1ccncc1
: