Target
Plasminogen activator inhibitor 1
Ligand
BDBM50116755
Substrate
Meas. Tech.
ChEBML_155614
IC50
8600±n/a nM
Citation
 Wang, SGolec, JMiller, WMilutinovic, SFolkes, AWilliams, SBrooks, THardman, KCharlton, PWren, SSpencer, J Novel inhibitors of plasminogen activator inhibitor-1: development of new templates from diketopiperazines. Bioorg Med Chem Lett 12:2367-70 (2002)  
Target
Name:
Plasminogen activator inhibitor 1
Synonyms:
Endothelial plasminogen activator inhibitor PAI-1 PAI1_HUMAN Plasminogen activator inhibitor 1 Plasminogen activator inhibitor-1 SERPINE1
Type:
Enzyme
Mol. Mass.:
45064.00
Organism:
Homo sapiens (Human)
Description:
P05121
Residue:
402
  
Inhibitor
Name:
BDBM50116755
Synonyms:
CHEMBL421503 | N-{4-[1,4-Dioxo-1,4-dihydro-2H-isoquinolin-(3Z)-ylidenemethyl]-phenyl}-benzamide
Type:
Small organic molecule
Emp. Form.:
C23H16N2O3
Mol. Mass.:
368.3847
SMILES:
O=C(Nc1ccc(\C=C2/NC(=O)c3ccccc3C2=O)cc1)c1ccccc1
: