Target
Plasminogen activator inhibitor 1
Ligand
BDBM50116762
Substrate
Meas. Tech.
ChEBML_155614
IC50
23600±n/a nM
Citation
 Wang, SGolec, JMiller, WMilutinovic, SFolkes, AWilliams, SBrooks, THardman, KCharlton, PWren, SSpencer, J Novel inhibitors of plasminogen activator inhibitor-1: development of new templates from diketopiperazines. Bioorg Med Chem Lett 12:2367-70 (2002)  
Target
Name:
Plasminogen activator inhibitor 1
Synonyms:
Endothelial plasminogen activator inhibitor PAI-1 PAI1_HUMAN Plasminogen activator inhibitor 1 Plasminogen activator inhibitor-1 SERPINE1
Type:
Enzyme
Mol. Mass.:
45064.00
Organism:
Homo sapiens (Human)
Description:
P05121
Residue:
402
  
Inhibitor
Name:
BDBM50116762
Synonyms:
3-(4-Chloro-phenyl)-4-hydroxy-2H-isoquinolin-1-one | CHEMBL308386
Type:
Small organic molecule
Emp. Form.:
C15H10ClNO2
Mol. Mass.:
271.698
SMILES:
Oc1c([nH]c(=O)c2ccccc12)-c1ccc(Cl)cc1
: