Target
Plasminogen activator inhibitor 1
Ligand
BDBM50116763
Substrate
Meas. Tech.
ChEBML_155614
IC50
14000±n/a nM
Citation
 Wang, SGolec, JMiller, WMilutinovic, SFolkes, AWilliams, SBrooks, THardman, KCharlton, PWren, SSpencer, J Novel inhibitors of plasminogen activator inhibitor-1: development of new templates from diketopiperazines. Bioorg Med Chem Lett 12:2367-70 (2002)  
Target
Name:
Plasminogen activator inhibitor 1
Synonyms:
Endothelial plasminogen activator inhibitor PAI-1 PAI1_HUMAN Plasminogen activator inhibitor 1 Plasminogen activator inhibitor-1 SERPINE1
Type:
Enzyme
Mol. Mass.:
45064.00
Organism:
Homo sapiens (Human)
Description:
P05121
Residue:
402
  
Inhibitor
Name:
BDBM50116763
Synonyms:
4-Hydroxy-1-oxo-1,2-dihydro-isoquinoline-3-carboxylic acid (3,4-dichloro-phenyl)-amide | CHEMBL78105
Type:
Small organic molecule
Emp. Form.:
C16H10Cl2N2O3
Mol. Mass.:
349.168
SMILES:
Oc1c([nH]c(=O)c2ccccc12)C(=O)Nc1ccc(Cl)c(Cl)c1
: