Target
Beta-1 adrenergic receptor
Ligand
BDBM50119187
Substrate
Meas. Tech.
ChEMBL_37254 (CHEMBL651575)
EC50
353±n/a nM
Citation
 Steffan, RJAshwell, MASolvibile, WRMatelan, ELargis, EHan, STillet, JMulvey, R Novel substituted 4-aminomethylpiperidines as potent and selective human beta3-agonists. Part 1: aryloxypropanolaminomethylpiperidines. Bioorg Med Chem Lett 12:2957-61 (2002)  
Target
Name:
Beta-1 adrenergic receptor
Synonyms:
ADRB1 ADRB1_HUMAN Beta-1 adrenoceptor adrenergic Beta1
Type:
G Protein-Coupled Receptor (GPCR)
Mol. Mass.:
51338.40
Organism:
Homo sapiens (Human)
Description:
P08588
Residue:
477
  
Inhibitor
Name:
BDBM50119187
Synonyms:
CHEMBL431048 | N-(5-{(S)-3-[(1-{4-[3-(2,5-Difluoro-benzyl)-ureido]-benzenesulfonyl}-piperidin-4-ylmethyl)-amino]-2-hydroxy-propoxy}-2-hydroxy-phenyl)-methanesulfonamide
Type:
Small organic molecule
Emp. Form.:
C30H37F2N5O8S2
Mol. Mass.:
697.77
SMILES:
CS(=O)(=O)Nc1cc(OC[C@@H](O)CNCC2CCN(CC2)S(=O)(=O)c2ccc(NC(=O)NCc3cc(F)ccc3F)cc2)ccc1O
: