Target
Endothelin-converting enzyme 1
Ligand
BDBM50119744
Substrate
Meas. Tech.
ChEBML_64356
IC50
30±n/a nM
Citation
 Firooznia, FGude, CChan, KTan, JFink, CASavage, PBeil, MEBruseo, CWTrapani, AJJeng, AY Synthesis and biological activity of potent heterocyclic thiol-based inhibitors of endothelin-converting enzyme-1. Bioorg Med Chem Lett 12:3059-62 (2002)  
Target
Name:
Endothelin-converting enzyme 1
Synonyms:
ECE-1 ECE1_HUMAN Endothelin-converting enzyme 1 (ECE1)
Type:
Enzyme
Mol. Mass.:
87155.11
Organism:
Homo sapiens (Human)
Description:
P42892
Residue:
770
  
Inhibitor
Name:
BDBM50119744
Synonyms:
2-{[1-(2-Mercapto-3-methyl-butyrylamino)-cyclopentanecarbonyl]-amino}-3-(6-thiophen-3-yl-pyridin-3-yl)-propionic acid | CHEMBL103327
Type:
Small organic molecule
Emp. Form.:
C23H29N3O4S2
Mol. Mass.:
475.624
SMILES:
CC(C)[C@H](S)C(=O)NC1(CCCC1)C(=O)NC(Cc1ccc(nc1)-c1ccsc1)C(O)=O
: