Target
Integrin alpha-V/beta-5
Ligand
BDBM50120521
Substrate
Meas. Tech.
ChEMBL_214771 (CHEMBL816229)
IC50
40±n/a nM
Citation
 Perron-Sierra, FSaint Dizier, DBertrand, MGenton, ATucker, GCCasara, P Substituted benzocyloheptenes as potent and selective alpha(v) integrin antagonists. Bioorg Med Chem Lett 12:3291-6 (2002)  
Target
Name:
Integrin alpha-V/beta-5
Synonyms:
ITGAV/ITGB5 | Integrin beta-5/Vitronectin receptor alpha
Type:
Enzyme
Mol. Mass.:
Description:
Components:
This complex has 2 components.
Component 1
Name:
Integrin alpha-V
Synonyms:
ITAV_HUMAN Integrin alpha-V/alpha-5 VNRA Vitronectin receptor | Vitronectin receptor subunit alpha
Type:
PROTEIN
Mol. Mass.:
116024.92
Organism:
Homo sapiens (Human)
Description:
ChEMBL_582336
Residue:
1048
  
Component 2
Name:
Integrin beta-5
Synonyms:
ITB5_HUMAN | ITGB5
Type:
PROTEIN
Mol. Mass.:
88047.37
Organism:
Homo sapiens (Human)
Description:
EBI_10915
Residue:
799
  
Inhibitor
Name:
BDBM50120521
Synonyms:
(7-{[4-(Methyl-pyridin-2-yl-amino)-butyrylamino]-methyl}-6,9-dihydro-5H-benzocyclohepten-5-yl)-acetic acid | CHEMBL111986
Type:
Small organic molecule
Emp. Form.:
C24H29N3O3
Mol. Mass.:
407.5054
SMILES:
CN(CCCC(=O)NCC1=CCc2ccccc2C(CC(O)=O)C1)c1ccccn1
: