Target
Sigma intracellular receptor 2
Ligand
BDBM15581
Substrate
Meas. Tech.
ChEMBL_2068299 (CHEMBL4723552)
Ki
505±n/a nM
Citation
 Ye, NQin, WTian, SXu, QWold, EAZhou, JZhen, XC Small Molecules Selectively Targeting Sigma-1 Receptor for the Treatment of Neurological Diseases. J Med Chem 63:15187-15217 (2020)  
Target
Name:
Sigma intracellular receptor 2
Synonyms:
S2r Sigma-2 receptor Tmem97 | Transmembrane protein 97
Type:
Mol. Mass.:
20818.69
Organism:
Mus musculus (Mouse)
Description:
Q8VD00
Residue:
176
  
Inhibitor
Name:
BDBM15581
Synonyms:
CHEMBL8706 CLORGILINE N-[3-(2,4-dichlorophenoxy)propyl]-N-methyl-prop-2-yn-1-amine US9603833, Clorgyline | [3-(2,4-dichlorophenoxy)propyl](methyl)prop-2-yn-1-ylamine
Type:
Small organic molecule
Emp. Form.:
C13H15Cl2NO
Mol. Mass.:
272.17
SMILES:
CN(CCCOc1ccc(Cl)cc1Cl)CC#C
: