Target
Vasopressin V2 receptor
Ligand
BDBM50125107
Substrate
Meas. Tech.
ChEBML_214716
IC50
12±n/a nM
Citation
 Matthews, JMGreco, MNHecker, LRHoekstra, WJAndrade-Gordon, Pde Garavilla, LDemarest, KTEricson, EGunnet, JWHageman, WLook, RMoore, JBMaryanoff, BE Synthesis and biological evaluation of novel indoloazepine derivatives as non-peptide vasopressin V2 receptor antagonists. Bioorg Med Chem Lett 13:753-6 (2003)  
Target
Name:
Vasopressin V2 receptor
Synonyms:
ADHR AVPR2 DIR Renal-type arginine vasopressin receptor V2R_HUMAN Vasopressin V2 receptor | Vasopressin receptor
Type:
Receptor
Mol. Mass.:
40295.28
Organism:
Homo sapiens (Human)
Description:
P30518
Residue:
371
  
Inhibitor
Name:
BDBM50125107
Synonyms:
6-{4-[(Biphenyl-2-carbonyl)-amino]-3-chloro-benzoyl}-3,4,5,6-tetrahydro-1H-azepino[4,3,2-cd]indole-2-sulfonic acid | CHEMBL166135
Type:
Small organic molecule
Emp. Form.:
C31H24ClN3O5S
Mol. Mass.:
586.057
SMILES:
OS(=O)(=O)c1[nH]c2cccc3N(CCCc1c23)C(=O)c1ccc(NC(=O)c2ccccc2-c2ccccc2)c(Cl)c1
: