Target
Vasopressin V2 receptor
Ligand
BDBM50125101
Substrate
Meas. Tech.
ChEBML_214880
IC50
1±n/a nM
Citation
 Matthews, JMGreco, MNHecker, LRHoekstra, WJAndrade-Gordon, Pde Garavilla, LDemarest, KTEricson, EGunnet, JWHageman, WLook, RMoore, JBMaryanoff, BE Synthesis and biological evaluation of novel indoloazepine derivatives as non-peptide vasopressin V2 receptor antagonists. Bioorg Med Chem Lett 13:753-6 (2003)  
Target
Name:
Vasopressin V2 receptor
Synonyms:
AVPR V2 Avpr2 V2R_RAT Vasopressin receptor
Type:
G-protein coupled receptor
Mol. Mass.:
40761.85
Organism:
Rattus norvegicus (Rat)
Description:
Residue:
371
  
Inhibitor
Name:
BDBM50125101
Synonyms:
Biphenyl-2-carboxylic acid [4-(1,3,4,5-tetrahydro-azepino[4,3,2-cd]indole-6-carbonyl)-phenyl]-amide | CHEMBL165670
Type:
Small organic molecule
Emp. Form.:
C31H25N3O2
Mol. Mass.:
471.5491
SMILES:
O=C(Nc1ccc(cc1)C(=O)N1CCCc2c[nH]c3cccc1c23)c1ccccc1-c1ccccc1
: