Target
4-diphosphocytidyl-2-C-methyl-D-erythritol kinase
Ligand
BDBM50562012
Substrate
Meas. Tech.
ChEMBL_2076657 (CHEMBL4732448)
IC50
91000±n/a nM
Citation
 Ropponen, HKDiamanti, ESiemens, AIllarionov, BHaupenthal, JFischer, MRottmann, MWitschel, MHirsch, AKH Assessment of the rules related to gaining activity against Gram-negative bacteria. RSC Med Chem 12:593-601 (2021)  
Target
Name:
4-diphosphocytidyl-2-C-methyl-D-erythritol kinase
Synonyms:
2.7.1.148 CMK ipk ychB | ychB
Type:
PROTEIN
Mol. Mass.:
30917.95
Organism:
Escherichia coli (strain K12)
Description:
ChEMBL_106624
Residue:
283
  
Inhibitor
Name:
BDBM50562012
Synonyms:
CHEMBL4749431
Type:
Small organic molecule
Emp. Form.:
C17H19N3O2S
Mol. Mass.:
329.417
SMILES:
CCCn1c(C)cc(-c2csc(NC(=O)c3ccco3)n2)c1C
: