Target
4-diphosphocytidyl-2-C-methyl-D-erythritol kinase
Ligand
BDBM50562013
Substrate
Meas. Tech.
ChEMBL_2076657 (CHEMBL4732448)
IC50
1000±n/a nM
Citation
 Ropponen, HKDiamanti, ESiemens, AIllarionov, BHaupenthal, JFischer, MRottmann, MWitschel, MHirsch, AKH Assessment of the rules related to gaining activity against Gram-negative bacteria. RSC Med Chem 12:593-601 (2021)  
Target
Name:
4-diphosphocytidyl-2-C-methyl-D-erythritol kinase
Synonyms:
2.7.1.148 CMK ipk ychB | ychB
Type:
PROTEIN
Mol. Mass.:
30917.95
Organism:
Escherichia coli (strain K12)
Description:
ChEMBL_106624
Residue:
283
  
Inhibitor
Name:
BDBM50562013
Synonyms:
CHEMBL3359036
Type:
Small organic molecule
Emp. Form.:
C14H18N4O3S2
Mol. Mass.:
354.448
SMILES:
Nc1nc(=O)n(cc1C#CCNS(=O)(=O)C1CC1)C1CCCS1
: