Target
Histamine H4 receptor
Ligand
BDBM50127602
Substrate
Meas. Tech.
ChEMBL_87085 (CHEMBL700763)
EC50
>0.000100±n/a nM
Citation
 Kazuta, YHirano, KNatsume, KYamada, SKimura, RMatsumoto, SFuruichi, KMatsuda, AShuto, S Cyclopropane-based conformational restriction of histamine. (1S,2S)-2-(2-aminoethyl)-1-(1H-imidazol-4-yl)cyclopropane, a highly selective agonist for the histamine H3 receptor, having a cis-cyclopropane structure. J Med Chem 46:1980-8 (2003)  
Target
Name:
Histamine H4 receptor
Synonyms:
AXOR35 GPCR105 HH4R HRH4 Histamine H4 receptor Histamine receptor (H3 and H4) SP9144
Type:
G Protein-Coupled Receptor (GPCR)
Mol. Mass.:
44517.02
Organism:
Homo sapiens (Human)
Description:
Binding assays were using CHO cells stably expressing hH4R receptors.
Residue:
390
  
Inhibitor
Name:
BDBM50127602
Synonyms:
C-[2-(1H-Imidazol-4-yl)-cyclopropyl]-methylamine | CHEMBL292924
Type:
Small organic molecule
Emp. Form.:
C7H11N3
Mol. Mass.:
137.1823
SMILES:
NC[C@H]1C[C@H]1c1cnc[nH]1
: