Target
Calcium/calmodulin-dependent protein kinase type 1
Ligand
BDBM50563780
Substrate
Meas. Tech.
ChEMBL_2084281 (CHEMBL4765544)
IC50
3000±n/a nM
Citation
 Beesu, MCaruso, GSalyer, ACShukla, NMKhetani, KKSmith, LJFox, LMTanji, HOhto, UShimizu, TDavid, SA Identification of a Human Toll-Like Receptor (TLR) 8-Specific Agonist and a Functional Pan-TLR Inhibitor in 2-Aminoimidazoles. J Med Chem 59:3311-30 (2016)  
Target
Name:
Calcium/calmodulin-dependent protein kinase type 1
Synonyms:
CAMK1 CaM kinase I alpha CaMKI-alpha KCC1A_HUMAN
Type:
PROTEIN
Mol. Mass.:
41325.04
Organism:
Homo sapiens (Human)
Description:
ChEMBL_655701
Residue:
370
  
Inhibitor
Name:
BDBM50563780
Synonyms:
CHEMBL4795714
Type:
Small organic molecule
Emp. Form.:
C21H26ClN3O
Mol. Mass.:
371.904
SMILES:
Cl.CCCCCn1cc(nc1N)-c1ccccc1OCc1ccccc1
: