Target
Phosphatidylinositol 4,5-bisphosphate 3-kinase catalytic subunit beta isoform
Ligand
BDBM198031
Substrate
Meas. Tech.
ChEMBL_2084639 (CHEMBL4765902)
EC50
42±n/a nM
Citation
 Patel, LChandrasekhar, JEvarts, JForseth, KHaran, ACIp, CKashishian, AKim, MKoditek, DKoppenol, SLad, LLepist, EIMcGrath, MEPerreault, SPuri, KDVillaseñor, AGSomoza, JRSteiner, BHTherrien, JTreiberg, JPhillips, G Discovery of Orally Efficacious Phosphoinositide 3-Kinase ? Inhibitors with Improved Metabolic Stability. J Med Chem 59:9228-9242 (2016)  
Target
Name:
Phosphatidylinositol 4,5-bisphosphate 3-kinase catalytic subunit beta isoform
Synonyms:
PI3-kinase p110 subunit beta PI3Kbeta PIK3CB Phosphatidylinositol 4,5-bisphosphate 3-kinase catalytic subunit beta (PI3Kbeta) Phosphatidylinositol 4,5-bisphosphate 3-kinase catalytic subunit beta isoform (PI3K) Phosphatidylinositol 4,5-bisphosphate 3-kinase catalytic subunit beta isoform (PI3Kbeta) Phosphatidylinositol-4,5-bisphosphate 3-kinase catalytic subunit beta isoform Phosphoinositide 3-Kinase (PI3K), beta Chain A PtdIns-3-kinase p110
Type:
Enzyme Subunit
Mol. Mass.:
122769.00
Organism:
Homo sapiens (Human)
Description:
P42338
Residue:
1070
  
Inhibitor
Name:
BDBM198031
Synonyms:
US9221795, 27
Type:
Small organic molecule
Emp. Form.:
C22H17ClFN9O
Mol. Mass.:
477.881
SMILES:
Nc1nc(N)c(C#N)c(N[C@@H](C2CC2)c2nc3c(F)ccc(Cl)c3c(=O)n2-c2cccnc2)n1
: