Target
Squalene--hopene cyclase
Ligand
BDBM50128056
Substrate
Meas. Tech.
ChEMBL_201950 (CHEMBL809137)
IC50
23±n/a nM
Citation
 Lenhart, AReinert, DJAebi, JDDehmlow, HMorand, OHSchulz, GE Binding structures and potencies of oxidosqualene cyclase inhibitors with the homologous squalene-hopene cyclase. J Med Chem 46:2083-92 (2003)  
Target
Name:
Squalene--hopene cyclase
Synonyms:
SQHC_ALIAD Squalene-hopene cyclase | shc
Type:
PROTEIN
Mol. Mass.:
71559.28
Organism:
Alicyclobacillus acidocaldarius
Description:
ChEMBL_201951
Residue:
631
  
Inhibitor
Name:
BDBM50128056
Synonyms:
(E)-N-allyl-4-(3-(4-bromophenyl)benzofuran-6-yloxy)-N-methylbut-2-en-1-aminium CHEMBL481811 N-allyl-4-(3-(4-bromophenyl)benzofuran-6-yloxy)-N-methylbut-2-en-1-aminium
Type:
Small organic molecule
Emp. Form.:
C22H22BrNO2
Mol. Mass.:
412.32
SMILES:
CN(CC=C)C\C=C\COc1ccc2c(coc2c1)-c1ccc(Br)cc1
: