Target
Ecdysone receptor
Ligand
BDBM50128305
Substrate
Meas. Tech.
ChEBML_65456
EC50
100±n/a nM
Citation
 Tice, CMHormann, REThompson, CSFriz, JLCavanaugh, CKSaggers, JA Optimization of alpha-acylaminoketone ecdysone agonists for control of gene expression. Bioorg Med Chem Lett 13:1883-6 (2003)  
Target
Name:
Ecdysone receptor
Synonyms:
20-hydroxy-ecdysone receptor ECR_BOMMO EcRH NR1H1 | Nuclear receptor subfamily 1 group H member 1
Type:
PROTEIN
Mol. Mass.:
68199.29
Organism:
Bombyx mori
Description:
ChEMBL_65456
Residue:
606
  
Inhibitor
Name:
BDBM50128305
Synonyms:
3-methoxy-2-methylbenzoic acid 2-(3,5-dimethylbenzoyl)-2-(1,1-dimethylethyl)hydrazide N'-(tert-butyl)-N'-(3,5-dimethylbenzoyl)-3-methoxy-2-methylbenzohydrazide N-tert-butyl-N'-(3-methoxy-o-toluoyl)-3,5-xylohydrazide | methoxyfenozide
Type:
Small organic molecule
Emp. Form.:
C22H28N2O3
Mol. Mass.:
368.4693
SMILES:
COc1cccc(C(=O)NN(C(=O)c2cc(C)cc(C)c2)C(C)(C)C)c1C
: