Target
Prostaglandin D2 receptor
Ligand
BDBM50128699
Substrate
Meas. Tech.
ChEMBL_157789 (CHEMBL767848)
IC50
90±n/a nM
Citation
 Mitsumori, STsuri, THonma, THiramatsu, YOkada, THashizume, HInagaki, MArimura, AYasui, KAsanuma, FKishino, JOhtani, M Synthesis and biological activity of various derivatives of a novel class of potent, selective, and orally active prostaglandin D2 receptor antagonists. 1. Bicyclo[2.2.1]heptane derivatives. J Med Chem 46:2436-45 (2003)  
Target
Name:
Prostaglandin D2 receptor
Synonyms:
PD2R_HUMAN Prostaglandin D2 Prostanoid DP receptor
Type:
Enzyme
Mol. Mass.:
40288.87
Organism:
Homo sapiens (Human)
Description:
Q13258
Residue:
359
  
Inhibitor
Name:
BDBM50128699
Synonyms:
(+) (E) 7-[3-(5-Styryl-thiophene-2-sulfonylamino)-bicyclo[2.2.1]hept-2-yl]-hept-5-enoic acid | CHEMBL81600
Type:
Small organic molecule
Emp. Form.:
C26H31NO4S2
Mol. Mass.:
485.659
SMILES:
OC(=O)CCC\C=C/C[C@@H]1[C@H]2CC[C@H](C2)[C@H]1NS(=O)(=O)c1ccc(\C=C\c2ccccc2)s1
: