Target
Prostaglandin D2 receptor
Ligand
BDBM50128750
Substrate
Meas. Tech.
ChEMBL_220127 (CHEMBL841411)
IC50
3.2±n/a nM
Citation
 Mitsumori, STsuri, THonma, THiramatsu, YOkada, THashizume, HKida, SInagaki, MArimura, AYasui, KAsanuma, FKishino, JOhtani, M Synthesis and biological activity of various derivatives of a novel class of potent, selective, and orally active prostaglandin D2 receptor antagonists. 2. 6,6-Dimethylbicyclo[3.1.1]heptane derivatives. J Med Chem 46:2446-55 (2003)  
Target
Name:
Prostaglandin D2 receptor
Synonyms:
PD2R_HUMAN Prostaglandin D2 Prostanoid DP receptor
Type:
Enzyme
Mol. Mass.:
40288.87
Organism:
Homo sapiens (Human)
Description:
Q13258
Residue:
359
  
Inhibitor
Name:
BDBM50128750
Synonyms:
7-{2-[(5-Fluoro-benzo[b]thiophene-3-carbonyl)-amino]-6,6-dimethyl-bicyclo[3.1.1]hept-3-yl}-hept-5-enoic acid | CHEMBL79943
Type:
Small organic molecule
Emp. Form.:
C25H30FNO3S
Mol. Mass.:
443.574
SMILES:
CC1(C)[C@@H]2C[C@H]1[C@H](NC(=O)c1csc3ccc(F)cc13)[C@@H](C\C=C\CCCC(O)=O)C2
: