Target
Serine protease 1
Ligand
BDBM14593
Substrate
Meas. Tech.
ChEBML_213045
IC50
64±n/a nM
Citation
 South, MSCase, BLWood, RSJones, DEHayes, MJGirard, TJLachance, RMNicholson, NSClare, MStevens, AMStegeman, RAStallings, WCKurumbail, RGParlow, JJ Structure-based drug design of pyrazinone antithrombotics as selective inhibitors of the tissue factor VIIa complex. Bioorg Med Chem Lett 13:2319-25 (2003)  
Target
Name:
Serine protease 1
Synonyms:
Alpha-trypsin chain 1 Beta-trypsin PRSS1 TRP1 TRY1_HUMAN Thrombin & trypsin Trypsin I | Trypsin-1
Type:
Enzyme
Mol. Mass.:
26557.80
Organism:
Homo sapiens (Human)
Description:
P07477
Residue:
247
  
Inhibitor
Name:
BDBM14593
Synonyms:
3-amino-5-[1-({[(4-carbamimidoylphenyl)methyl]carbamoyl}methyl)-3-chloro-6-oxo-5-(propan-2-ylamino)-1,6-dihydropyrazin-2-yl]benzoic acid Pyrazinone Analog 34
Type:
Small organic molecule
Emp. Form.:
C24H26ClN7O4
Mol. Mass.:
511.961
SMILES:
CC(C)Nc1nc(Cl)c(-c2cc(N)cc(c2)C(O)=O)n(CC(=O)NCc2ccc(cc2)C(N)=N)c1=O
: