Target
Coagulation factor X
Ligand
BDBM50129981
Substrate
Meas. Tech.
ChEBML_48978
IC50
1410±n/a nM
Citation
 South, MSCase, BLWood, RSJones, DEHayes, MJGirard, TJLachance, RMNicholson, NSClare, MStevens, AMStegeman, RAStallings, WCKurumbail, RGParlow, JJ Structure-based drug design of pyrazinone antithrombotics as selective inhibitors of the tissue factor VIIa complex. Bioorg Med Chem Lett 13:2319-25 (2003)  
Target
Name:
Coagulation factor X
Synonyms:
Activated coagulation factor X (FXa) Coagulation factor X precursor F10 Factor X heavy chain Factor Xa Stuart-Prower factor
Type:
Enzyme
Mol. Mass.:
54726.60
Organism:
Homo sapiens (Human)
Description:
Residue:
488
  
Inhibitor
Name:
BDBM50129981
Synonyms:
2-(5-Chloro-2-oxo-3-phenethylamino-6-phenyl-2H-pyrazin-1-yl)-N-[(S)-4-guanidino-1-(thiazole-2-carbonyl)-butyl]-acetamide | CHEMBL77982
Type:
Small organic molecule
Emp. Form.:
C29H31ClN8O3S
Mol. Mass.:
607.126
SMILES:
NC(=N)NCCC[C@H](NC(=O)Cn1c(c(Cl)nc(NCCc2ccccc2)c1=O)-c1ccccc1)C(=O)c1nccs1
: