Target
Coagulation factor X
Ligand
BDBM50129982
Substrate
Meas. Tech.
ChEBML_48978
IC50
2900±n/a nM
Citation
 South, MSCase, BLWood, RSJones, DEHayes, MJGirard, TJLachance, RMNicholson, NSClare, MStevens, AMStegeman, RAStallings, WCKurumbail, RGParlow, JJ Structure-based drug design of pyrazinone antithrombotics as selective inhibitors of the tissue factor VIIa complex. Bioorg Med Chem Lett 13:2319-25 (2003)  
Target
Name:
Coagulation factor X
Synonyms:
Activated coagulation factor X (FXa) Coagulation factor X precursor F10 Factor X heavy chain Factor Xa Stuart-Prower factor
Type:
Enzyme
Mol. Mass.:
54726.60
Organism:
Homo sapiens (Human)
Description:
Residue:
488
  
Inhibitor
Name:
BDBM50129982
Synonyms:
(S)-2-(6-benzyl-5-chloro-2-oxo-3-(phenethylamino)pyrazin-1(2H)-yl)-N-(5-guanidino-1-oxo-1-(thiazol-2-yl)pentan-2-yl)acetamide CHEMBL308948
Type:
Small organic molecule
Emp. Form.:
C30H33ClN8O3S
Mol. Mass.:
621.153
SMILES:
NC(=N)NCCC[C@H](NC(=O)Cn1c(Cc2ccccc2)c(Cl)nc(NCCc2ccccc2)c1=O)C(=O)c1nccs1
: