Target
Alpha-2A adrenergic receptor
Ligand
BDBM50131354
Substrate
Meas. Tech.
ChEBML_33076
Ki
5±n/a nM
Citation
 Andrés, JIAlcázar, JAlonso, JMAlvarez, RMCid, JMDe Lucas, AIFernández, JMartínez, SNieto, CPastor, JBakker, MHBiesmans, IHeylen, LIMegens, AA Synthesis of 3a,4-dihydro-3H-[1]benzopyrano[4,3-c]isoxazoles, displaying combined 5-HT uptake inhibiting and alpha(2)-adrenoceptor antagonistic activities: a novel series of potential antidepressants. Bioorg Med Chem Lett 13:2719-25 (2003)  
Target
Name:
Alpha-2A adrenergic receptor
Synonyms:
ADA2A_HUMAN ADRA2R Adrenergic alpha2A Alpha-2 adrenergic receptor subtype C10 Alpha-2A adrenoreceptor alpha-2A adrenergic receptor [Homo sapiens]
Type:
Enzyme
Mol. Mass.:
48979.91
Organism:
Homo sapiens (Human)
Description:
P08913
Residue:
465
  
Inhibitor
Name:
BDBM50131354
Synonyms:
7,8-Dimethoxy-3-(4-naphthalen-2-ylmethyl-piperazin-1-ylmethyl)-3a,4-dihydro-3H-chromeno[4,3-c]isoxazole | CHEMBL94129
Type:
Small organic molecule
Emp. Form.:
C28H31N3O4
Mol. Mass.:
473.5634
SMILES:
COc1cc2OCC3C(CN4CCN(Cc5ccc6ccccc6c5)CC4)ON=C3c2cc1OC
: