Target
Toll-like receptor 7
Ligand
BDBM50467786
Substrate
Meas. Tech.
ChEMBL_2105849 (CHEMBL4814524)
IC50
700±n/a nM
Citation
 Pal, SPaul, BBandopadhyay, PPreethy, NSarkar, DRahaman, OGoon, SRoy, SGanguly, DTalukdar, A Synthesis and characterization of new potent TLR7 antagonists based on analysis of the binding mode using biomolecular simulations. Eur J Med Chem 210:0 (2021)  
Target
Name:
Toll-like receptor 7
Synonyms:
ORF Names:UNQ248/PRO285 TLR7_HUMAN | Toll-like receptor 7 (TLR7)
Type:
Enzyme
Mol. Mass.:
120945.35
Organism:
Homo sapiens (Human)
Description:
Q9NYK1
Residue:
1049
  
Inhibitor
Name:
BDBM50467786
Synonyms:
CHEMBL4281194
Type:
Small organic molecule
Emp. Form.:
C28H44N6O2
Mol. Mass.:
496.688
SMILES:
COc1cc2c(nc(nc2cc1OCCCN1CCCC1)N(C)C)N1CCN(CC2CCCC2)CC1
: