Target
Acetylcholinesterase
Ligand
BDBM50327939
Substrate
Meas. Tech.
ChEMBL_2114062 (CHEMBL4822912)
IC50
10000±n/a nM
Citation
 Mezeiova, EHrabinova, MHepnarova, VJun, DJanockova, JMuckova, LPrchal, LKristofikova, ZKucera, TGorecki, LChalupova, KKunes, JHroudova, JSoukup, OKorabecny, J Huprine Y - Tryptophan heterodimers with potential implication to Alzheimer's disease treatment. Bioorg Med Chem Lett 43:0 (2021)  
Target
Name:
Acetylcholinesterase
Synonyms:
ACES_HUMAN Acetylcholinesterase (AChE) | Acetylcholinesterase (human AChE)
Type:
Enzyme
Mol. Mass.:
67792.70
Organism:
Homo sapiens (Human)
Description:
P22303
Residue:
614
  
Inhibitor
Name:
BDBM50327939
Synonyms:
7-methoxytacrine | CHEMBL1256415
Type:
Small organic molecule
Emp. Form.:
C14H16N2O
Mol. Mass.:
228.2896
SMILES:
COc1ccc2nc3CCCCc3c(N)c2c1
: