Target
ATP-dependent translocase ABCB1
Ligand
BDBM50572478
Substrate
Meas. Tech.
ChEMBL_2116923 (CHEMBL4825989)
EC50
6.4±n/a nM
Citation
 Smolinski, MPUrgaonkar, SPitzonka, LCutler, MLee, GSuh, KHLau, JYN Discovery of Encequidar, First-in-Class Intestine Specific P-glycoprotein Inhibitor. J Med Chem 64:3677-3693 (2021)  
Target
Name:
ATP-dependent translocase ABCB1
Synonyms:
ABCB1 MDR1_HUMAN Multidrug resistance protein 1 P-glycoprotein (P-gp) PGY1
Type:
Protein
Mol. Mass.:
141503.50
Organism:
Homo sapiens (Human)
Description:
P08183
Residue:
1280
  
Inhibitor
Name:
BDBM50572478
Synonyms:
CHEMBL4878833
Type:
Small organic molecule
Emp. Form.:
C33H34N6O5S
Mol. Mass.:
626.725
SMILES:
COc1cc2CCN(CCc3ccc(cc3)-n3nnc(n3)-c3cc(OC)c(OC)cc3NC(=O)c3ccsc3)Cc2cc1OC
: