Target
Cytochrome P450 2C9
Ligand
BDBM50138611
Substrate
Meas. Tech.
ChEBML_51528
IC50
>100000±n/a nM
Citation
 Koltun, DOMarquart, TAShenk, KDElzein, ELi, YNguyen, MKerwar, SZeng, DChu, NSoohoo, DHao, JMaydanik, VYLustig, DANg, KJFraser, HZablocki, JA New fatty acid oxidation inhibitors with increased potency lacking adverse metabolic and electrophysiological properties. Bioorg Med Chem Lett 14:549-52 (2003)  
Target
Name:
Cytochrome P450 2C9
Synonyms:
(R)-limonene 6-monooxygenase CP2C9_HUMAN CYP2C9 Cytochrome P450 2C9 (CYP2C9 ) P-450MP P450 PB-1 | S-mephenytoin 4-hydroxylase
Type:
Enzyme
Mol. Mass.:
55636.33
Organism:
Homo sapiens (Human)
Description:
P11712
Residue:
490
  
Inhibitor
Name:
BDBM50138611
Synonyms:
CHEMBL150614 | N-(9-Ethyl-9H-carbazol-3-yl)-2-{4-[(R)-2-hydroxy-3-(2-methyl-benzothiazol-5-yloxy)-propyl]-piperazin-1-yl}-acetamide
Type:
Small organic molecule
Emp. Form.:
C31H35N5O3S
Mol. Mass.:
557.706
SMILES:
CCn1c2ccccc2c2cc(NC(=O)CN3CCN(C[C@@H](O)COc4ccc5sc(C)nc5c4)CC3)ccc12
: