Target
Histamine H3 receptor
Ligand
BDBM50139337
Substrate
Meas. Tech.
ChEBML_86753
Ki
1.4±n/a nM
Citation
 Gfesser, GAZhang, HDinges, JFox, GBPan, JBEsbenshade, TAYao, BBWitte, DMiller, TRKang, CHKrueger, KMBennani, YLHancock, AAFaghih, R Structure-activity relationships of non-imidazole H(3) receptor ligands. Part 3: 5-Substituted 3-phenyl-1,2,4-oxadiazoles as potent antagonists. Bioorg Med Chem Lett 14:673-6 (2004)  
Target
Name:
Histamine H3 receptor
Synonyms:
HH3R Hrh3
Type:
G Protein-Coupled Receptor (GPCR)
Mol. Mass.:
48607.98
Organism:
Rattus norvegicus (rat)
Description:
Residue:
445
  
Inhibitor
Name:
BDBM50139337
Synonyms:
CHEMBL158802 | N-[(R)-2-(4-{3-[4-(5-Cyclopentylmethyl-[1,2,4]oxadiazol-3-yl)-3-fluoro-phenoxy]-propyl}-[1,4]diazepan-1-yl)-1-methyl-2-oxo-ethyl]-4-methyl-benzamide
Type:
Small organic molecule
Emp. Form.:
C33H42FN5O4
Mol. Mass.:
591.7161
SMILES:
C[C@@H](NC(=O)c1ccc(C)cc1)C(=O)N1CCCN(CCCOc2ccc(-c3noc(CC4CCCC4)n3)c(F)c2)CC1
: