Target
Transporter
Ligand
BDBM50144305
Substrate
Meas. Tech.
ChEBML_143113
Ki
10000±n/a nM
Citation
 Bois, FBaldwin, RMKula, NSBaldessarini, RJInnis, RBTamagnan, G Synthesis and monoamine transporter affinity of 3'-analogs of 2-beta-carbomethoxy-3-beta-(4'-iodophenyl)tropane (beta-CIT). Bioorg Med Chem Lett 14:2117-20 (2004)  
Target
Name:
Transporter
Synonyms:
Monoamine transporters; Norepininephrine & dopamine | Norepinephrine Monoamine transporters
Type:
PROTEIN
Mol. Mass.:
66787.87
Organism:
Rattus norvegicus
Description:
ChEMBL_1463061
Residue:
597
  
Inhibitor
Name:
BDBM50144305
Synonyms:
3-(3-Furan-2-yl-phenyl)-8-methyl-8-aza-bicyclo[3.2.1]octane-2-carboxylic acid methyl ester | CHEMBL303494
Type:
Small organic molecule
Emp. Form.:
C20H23NO3
Mol. Mass.:
325.4015
SMILES:
COC(=O)C1C2CCC(CC1c1cccc(c1)-c1ccco1)N2C
: