Target
Transporter
Ligand
BDBM50144306
Substrate
Meas. Tech.
ChEBML_143113
Ki
282±n/a nM
Citation
 Bois, FBaldwin, RMKula, NSBaldessarini, RJInnis, RBTamagnan, G Synthesis and monoamine transporter affinity of 3'-analogs of 2-beta-carbomethoxy-3-beta-(4'-iodophenyl)tropane (beta-CIT). Bioorg Med Chem Lett 14:2117-20 (2004)  
Target
Name:
Transporter
Synonyms:
Monoamine transporters; Norepininephrine & dopamine | Norepinephrine Monoamine transporters
Type:
PROTEIN
Mol. Mass.:
66787.87
Organism:
Rattus norvegicus
Description:
ChEMBL_1463061
Residue:
597
  
Inhibitor
Name:
BDBM50144306
Synonyms:
3-(3-Iodo-phenyl)-8-aza-bicyclo[3.2.1]octane-2-carboxylic acid methyl ester | CHEMBL66068
Type:
Small organic molecule
Emp. Form.:
C15H18INO2
Mol. Mass.:
371.2134
SMILES:
COC(=O)C1C2CCC(CC1c1cccc(I)c1)N2
: