Target
Sodium-dependent serotonin transporter
Ligand
BDBM50046736
Substrate
Meas. Tech.
ChEBML_201835
Ki
9.8±n/a nM
Citation
 Bois, FBaldwin, RMKula, NSBaldessarini, RJInnis, RBTamagnan, G Synthesis and monoamine transporter affinity of 3'-analogs of 2-beta-carbomethoxy-3-beta-(4'-iodophenyl)tropane (beta-CIT). Bioorg Med Chem Lett 14:2117-20 (2004)  
Target
Name:
Sodium-dependent serotonin transporter
Synonyms:
5-HT Transporter 5HT transporter Anandamid membrane transporter, AMT Monoamine transporters; Norepinephrine & serotonin Slc6a4 Sodium-dependent serotonin transporter (SERT) | imipramine receptor
Type:
Multi-pass membrane protein
Mol. Mass.:
70168.43
Organism:
Rattus norvegicus (rat)
Description:
P31652
Residue:
630
  
Inhibitor
Name:
BDBM50046736
Synonyms:
(R)-3-(3-Iodo-phenyl)-8-methyl-8-aza-bicyclo[3.2.1]octane-2-carboxylic acid methyl ester 3-(4-Fluoro-phenyl)-8-methyl-8-aza-bicyclo[3.2.1]octane-2-carboxylic acid methyl ester | CHEMBL67387
Type:
Small organic molecule
Emp. Form.:
C16H20INO2
Mol. Mass.:
385.24
SMILES:
COC(=O)C1C2CCC(CC1c1cccc(I)c1)N2C
: