Target
Sodium-dependent dopamine transporter
Ligand
BDBM50144307
Substrate
Meas. Tech.
ChEBML_61656
Ki
8.8±n/a nM
Citation
 Bois, FBaldwin, RMKula, NSBaldessarini, RJInnis, RBTamagnan, G Synthesis and monoamine transporter affinity of 3'-analogs of 2-beta-carbomethoxy-3-beta-(4'-iodophenyl)tropane (beta-CIT). Bioorg Med Chem Lett 14:2117-20 (2004)  
Target
Name:
Sodium-dependent dopamine transporter
Synonyms:
DA transporter DAT1 Dopamine transporter protein (DAT) SC6A3_HUMAN Sodium-dependent dopamine transporter Solute carrier family 6 member 3
Type:
Multi-pass membrane protein
Mol. Mass.:
68497.11
Organism:
Homo sapiens (Human)
Description:
Q01959
Residue:
620
  
Inhibitor
Name:
BDBM50144307
Synonyms:
3-Biphenyl-3-yl-8-methyl-8-aza-bicyclo[3.2.1]octane-2-carboxylic acid methyl ester | CHEMBL294733
Type:
Small organic molecule
Emp. Form.:
C22H25NO2
Mol. Mass.:
335.4394
SMILES:
COC(=O)C1C2CCC(CC1c1cccc(c1)-c1ccccc1)N2C
: