Target
Glucocorticoid receptor
Ligand
BDBM50144468
Substrate
Meas. Tech.
ChEMBL_71256 (CHEMBL685250)
IC50
340±n/a nM
Citation
 Link, JTSorensen, BKPatel, JEmery, MGrynfarb, MGoos-Nilsson, A Discovery of novel nonsteroidal glucocorticoid receptor modulators. Bioorg Med Chem Lett 14:2209-12 (2004)  
Target
Name:
Glucocorticoid receptor
Synonyms:
GCR_HUMAN GRL Glucocorticoid receptor (GRFP) Nuclear receptor subfamily 3 group C member 1
Type:
Enzyme
Mol. Mass.:
85656.87
Organism:
Homo sapiens (Human)
Description:
P04150
Residue:
777
  
Inhibitor
Name:
BDBM50144468
Synonyms:
CHEMBL71450 | N-{3-[(4-Allyloxy-benzyl)-benzyl-amino]-2-methyl-phenyl}-methanesulfonamide
Type:
Small organic molecule
Emp. Form.:
C25H28N2O3S
Mol. Mass.:
436.566
SMILES:
Cc1c(NS(C)(=O)=O)cccc1N(Cc1ccccc1)Cc1ccc(OCC=C)cc1
: