Target
Glucocorticoid receptor
Ligand
BDBM50144457
Substrate
Meas. Tech.
ChEMBL_71256 (CHEMBL685250)
IC50
250±n/a nM
Citation
 Link, JTSorensen, BKPatel, JEmery, MGrynfarb, MGoos-Nilsson, A Discovery of novel nonsteroidal glucocorticoid receptor modulators. Bioorg Med Chem Lett 14:2209-12 (2004)  
Target
Name:
Glucocorticoid receptor
Synonyms:
GCR_HUMAN GRL Glucocorticoid receptor (GRFP) Nuclear receptor subfamily 3 group C member 1
Type:
Enzyme
Mol. Mass.:
85656.87
Organism:
Homo sapiens (Human)
Description:
P04150
Residue:
777
  
Inhibitor
Name:
BDBM50144457
Synonyms:
CHEMBL419633 | N-(3-Dibenzylamino-2-methyl-phenyl)-methanesulfonamide
Type:
Small organic molecule
Emp. Form.:
C22H24N2O2S
Mol. Mass.:
380.503
SMILES:
Cc1c(NS(C)(=O)=O)cccc1N(Cc1ccccc1)Cc1ccccc1
: