Target
Glucocorticoid receptor
Ligand
BDBM50144477
Substrate
Meas. Tech.
ChEMBL_71256 (CHEMBL685250)
IC50
400±n/a nM
Citation
 Link, JTSorensen, BKPatel, JEmery, MGrynfarb, MGoos-Nilsson, A Discovery of novel nonsteroidal glucocorticoid receptor modulators. Bioorg Med Chem Lett 14:2209-12 (2004)  
Target
Name:
Glucocorticoid receptor
Synonyms:
GCR_HUMAN GRL Glucocorticoid receptor (GRFP) Nuclear receptor subfamily 3 group C member 1
Type:
Enzyme
Mol. Mass.:
85656.87
Organism:
Homo sapiens (Human)
Description:
P04150
Residue:
777
  
Inhibitor
Name:
BDBM50144477
Synonyms:
CHEMBL71818 | Ethanesulfonic acid (3-dibenzylamino-2-methyl-phenyl)-amide
Type:
Small organic molecule
Emp. Form.:
C23H26N2O2S
Mol. Mass.:
394.53
SMILES:
CCS(=O)(=O)Nc1cccc(N(Cc2ccccc2)Cc2ccccc2)c1C
: