Target
Glucocorticoid receptor
Ligand
BDBM50144470
Substrate
Meas. Tech.
ChEMBL_71256 (CHEMBL685250)
IC50
450±n/a nM
Citation
 Link, JTSorensen, BKPatel, JEmery, MGrynfarb, MGoos-Nilsson, A Discovery of novel nonsteroidal glucocorticoid receptor modulators. Bioorg Med Chem Lett 14:2209-12 (2004)  
Target
Name:
Glucocorticoid receptor
Synonyms:
GCR_HUMAN GRL Glucocorticoid receptor (GRFP) Nuclear receptor subfamily 3 group C member 1
Type:
Enzyme
Mol. Mass.:
85656.87
Organism:
Homo sapiens (Human)
Description:
P04150
Residue:
777
  
Inhibitor
Name:
BDBM50144470
Synonyms:
CHEMBL306491 | N-{3-[Benzyl-(3-methoxy-benzyl)-amino]-2-methyl-phenyl}-methanesulfonamide
Type:
Small organic molecule
Emp. Form.:
C23H26N2O3S
Mol. Mass.:
410.529
SMILES:
COc1cccc(CN(Cc2ccccc2)c2cccc(NS(C)(=O)=O)c2C)c1
: