Target
Glucocorticoid receptor
Ligand
BDBM50144475
Substrate
Meas. Tech.
ChEMBL_71100 (CHEMBL679612)
IC50
58±n/a nM
Citation
 Link, JTSorensen, BKPatel, JEmery, MGrynfarb, MGoos-Nilsson, A Discovery of novel nonsteroidal glucocorticoid receptor modulators. Bioorg Med Chem Lett 14:2209-12 (2004)  
Target
Name:
Glucocorticoid receptor
Synonyms:
GCR_HUMAN GRL Glucocorticoid receptor (GRFP) Nuclear receptor subfamily 3 group C member 1
Type:
Enzyme
Mol. Mass.:
85656.87
Organism:
Homo sapiens (Human)
Description:
P04150
Residue:
777
  
Inhibitor
Name:
BDBM50144475
Synonyms:
CHEMBL70574 | N-{3-[Benzyl-(4-methyl-benzyl)-amino]-2-methyl-phenyl}-methanesulfonamide
Type:
Small organic molecule
Emp. Form.:
C23H26N2O2S
Mol. Mass.:
394.53
SMILES:
Cc1ccc(CN(Cc2ccccc2)c2cccc(NS(C)(=O)=O)c2C)cc1
: