Target
Glucocorticoid receptor
Ligand
BDBM50144488
Substrate
Meas. Tech.
ChEMBL_71100 (CHEMBL679612)
IC50
17±n/a nM
Citation
 Link, JTSorensen, BKPatel, JEmery, MGrynfarb, MGoos-Nilsson, A Discovery of novel nonsteroidal glucocorticoid receptor modulators. Bioorg Med Chem Lett 14:2209-12 (2004)  
Target
Name:
Glucocorticoid receptor
Synonyms:
GCR_HUMAN GRL Glucocorticoid receptor (GRFP) Nuclear receptor subfamily 3 group C member 1
Type:
Enzyme
Mol. Mass.:
85656.87
Organism:
Homo sapiens (Human)
Description:
P04150
Residue:
777
  
Inhibitor
Name:
BDBM50144488
Synonyms:
CHEMBL308743 | N-{3-[Benzyl-(4-chloro-benzyl)-amino]-2-methyl-phenyl}-methanesulfonamide
Type:
Small organic molecule
Emp. Form.:
C22H23ClN2O2S
Mol. Mass.:
414.948
SMILES:
Cc1c(NS(C)(=O)=O)cccc1N(Cc1ccccc1)Cc1ccc(Cl)cc1
: