Target
Poly [ADP-ribose] polymerase 1
Ligand
BDBM50145225
Substrate
Meas. Tech.
ChEBML_159827
Ki
5.9±n/a nM
Citation
 White, AWCurtin, NJEastman, BWGolding, BTHostomsky, ZKyle, SLi, JMaegley, KASkalitzky, DJWebber, SEYu, XHGriffin, RJ Potentiation of cytotoxic drug activity in human tumour cell lines, by amine-substituted 2-arylbenzimidazole-4-carboxamide PARP-1 inhibitors. Bioorg Med Chem Lett 14:2433-7 (2004)  
Target
Name:
Poly [ADP-ribose] polymerase 1
Synonyms:
(ARTD1 or PARP1) 2.4.2.30 ADPRT ARTD1 Human diphtheria toxin-like ADP-ribosyltransferase (ARTD1 or PARP1) NT-PARP-1 PARP1 PPOL Poly [ADP-ribose] polymerase 1 (PARP) Poly [ADP-ribose] polymerase 1 (PARP1) Poly [ADP-ribose] polymerase 1, 28-kDa form Poly [ADP-ribose] polymerase 1, processed C-terminus Poly [ADP-ribose] polymerase-1 Poly(ADP-ribose) polymerase-1 (ARTD1/PARP1) Protein poly-ADP-ribosyltransferase PARP1 | Synonyms=ADPRT
Type:
Mol. Mass.:
113114.22
Organism:
Homo sapiens (Human)
Description:
P09874
Residue:
1014
  
Inhibitor
Name:
BDBM50145225
Synonyms:
2-(4-Pyrrolidin-1-ylmethyl-phenyl)-1H-benzoimidazole-4-carboxylic acid amide | CHEMBL312135
Type:
Small organic molecule
Emp. Form.:
C19H20N4O
Mol. Mass.:
320.3883
SMILES:
NC(=O)c1cccc2[nH]c(nc12)-c1ccc(CN2CCCC2)cc1
: