Target
Estrogen receptor
Ligand
BDBM50146201
Substrate
Meas. Tech.
ChEBML_67500
IC50
0.500000±n/a nM
Citation
 Chesworth, RZawistoski, MPLefker, BACameron, KODay, RFMangano, FMRosati, RLColella, SPetersen, DNBrault, ALu, BPan, LCPerry, PNg, OCastleberry, TAOwen, TABrown, TAThompson, DDDaSilva-Jardine, P Tetrahydroisoquinolines as subtype selective estrogen agonists/antagonists. Bioorg Med Chem Lett 14:2729-33 (2004)  
Target
Name:
Estrogen receptor
Synonyms:
ER ESR ESR1_HUMAN Estrogen receptor Estrogen receptor (ER-alpha) Estrogen receptor alpha (ER) Nuclear receptor subfamily 3 group A member 1
Type:
Protein
Mol. Mass.:
66230.44
Organism:
Homo sapiens (Human)
Description:
P03372
Residue:
595
  
Inhibitor
Name:
BDBM50146201
Synonyms:
6-Phenyl-5-[4-(2-pyrrolidin-1-yl-ethoxy)-phenyl]-5,6,7,8-tetrahydro-naphthalen-2-ol | CHEMBL92748
Type:
Small organic molecule
Emp. Form.:
C28H31NO2
Mol. Mass.:
413.5512
SMILES:
Oc1ccc2C(C(CCc2c1)c1ccccc1)c1ccc(OCCN2CCCC2)cc1
: