Target
Complement C1s subcomponent
Ligand
BDBM50147050
Substrate
Meas. Tech.
ChEBML_48032
Ki
460±n/a nM
Citation
 Subasinghe, NLAli, FIllig, CRJonathan Rudolph, MKlein, SKhalil, ESoll, RMBone, RFSpurlino, JCDesJarlais, RLCrysler, CSCummings, MDMorris, PEKilpatrick, JMSudhakara Babu, Y A novel series of potent and selective small molecule inhibitors of the complement component C1s. Bioorg Med Chem Lett 14:3043-7 (2004)  
Target
Name:
Complement C1s subcomponent
Synonyms:
C1 esterase C1S_HUMAN Complement C1s subcomponent Complement C1s subcomponent light chain Trypsin | complement component 1, s subcomponent
Type:
Protein
Mol. Mass.:
76657.91
Organism:
Homo sapiens (Human)
Description:
P09871
Residue:
688
  
Inhibitor
Name:
BDBM50147050
Synonyms:
4-[4-(1-Methyl-1H-pyrazol-4-yl)-thiazol-2-yl]-5-methylsulfanyl-thiophene-2-carboxamidine | CHEMBL102417
Type:
Small organic molecule
Emp. Form.:
C13H13N5S3
Mol. Mass.:
335.471
SMILES:
CSc1sc(cc1-c1nc(cs1)-c1cnn(C)c1)C(N)=N
: