Target
Complement C1s subcomponent
Ligand
BDBM50147055
Substrate
Meas. Tech.
ChEBML_48032
Ki
1500±n/a nM
Citation
 Subasinghe, NLAli, FIllig, CRJonathan Rudolph, MKlein, SKhalil, ESoll, RMBone, RFSpurlino, JCDesJarlais, RLCrysler, CSCummings, MDMorris, PEKilpatrick, JMSudhakara Babu, Y A novel series of potent and selective small molecule inhibitors of the complement component C1s. Bioorg Med Chem Lett 14:3043-7 (2004)  
Target
Name:
Complement C1s subcomponent
Synonyms:
C1 esterase C1S_HUMAN Complement C1s subcomponent Complement C1s subcomponent light chain Trypsin | complement component 1, s subcomponent
Type:
Protein
Mol. Mass.:
76657.91
Organism:
Homo sapiens (Human)
Description:
P09871
Residue:
688
  
Inhibitor
Name:
BDBM50147055
Synonyms:
4-{4-[5-(3-Methyl-butoxy)-1-phenyl-1H-pyrazol-4-yl]-thiazol-2-yl}-5-methylsulfanyl-thiophene-2-carboxamidine | CHEMBL101698
Type:
Small organic molecule
Emp. Form.:
C23H25N5OS3
Mol. Mass.:
483.673
SMILES:
CSc1sc(cc1-c1nc(cs1)-c1cnn(c1OCCC(C)C)-c1ccccc1)C(N)=N
: