Target
Serine protease 1
Ligand
BDBM50147046
Substrate
Meas. Tech.
ChEBML_213078
Ki
180±n/a nM
Citation
 Subasinghe, NLAli, FIllig, CRJonathan Rudolph, MKlein, SKhalil, ESoll, RMBone, RFSpurlino, JCDesJarlais, RLCrysler, CSCummings, MDMorris, PEKilpatrick, JMSudhakara Babu, Y A novel series of potent and selective small molecule inhibitors of the complement component C1s. Bioorg Med Chem Lett 14:3043-7 (2004)  
Target
Name:
Serine protease 1
Synonyms:
Alpha-trypsin chain 1 Beta-trypsin PRSS1 TRP1 TRY1_HUMAN Thrombin & trypsin Trypsin I | Trypsin-1
Type:
Enzyme
Mol. Mass.:
26557.80
Organism:
Homo sapiens (Human)
Description:
P07477
Residue:
247
  
Inhibitor
Name:
BDBM50147046
Synonyms:
5-Methylsulfanyl-4-[4-(5-propoxy-1-pyridin-2-yl-1H-pyrazol-4-yl)-thiazol-2-yl]-thiophene-2-carboxamidine | CHEMBL317917
Type:
Small organic molecule
Emp. Form.:
C20H20N6OS3
Mol. Mass.:
456.607
SMILES:
CCCOc1c(cnn1-c1ccccn1)-c1csc(n1)-c1cc(sc1SC)C(N)=N
: