Target
Complement C1s subcomponent
Ligand
BDBM50099914
Substrate
Meas. Tech.
ChEBML_48032
Ki
640±n/a nM
Citation
 Subasinghe, NLAli, FIllig, CRJonathan Rudolph, MKlein, SKhalil, ESoll, RMBone, RFSpurlino, JCDesJarlais, RLCrysler, CSCummings, MDMorris, PEKilpatrick, JMSudhakara Babu, Y A novel series of potent and selective small molecule inhibitors of the complement component C1s. Bioorg Med Chem Lett 14:3043-7 (2004)  
Target
Name:
Complement C1s subcomponent
Synonyms:
C1 esterase C1S_HUMAN Complement C1s subcomponent Complement C1s subcomponent light chain Trypsin | complement component 1, s subcomponent
Type:
Protein
Mol. Mass.:
76657.91
Organism:
Homo sapiens (Human)
Description:
P09871
Residue:
688
  
Inhibitor
Name:
BDBM50099914
Synonyms:
4-[4-(2,4-Dimethoxy-phenyl)-thiazol-2-yl]-5-methylsulfanyl-thiophene-2-carboxamidine | CHEMBL286267
Type:
Small organic molecule
Emp. Form.:
C17H17N3O2S3
Mol. Mass.:
391.531
SMILES:
COc1ccc(-c2csc(n2)-c2cc(sc2SC)C(N)=N)c(OC)c1
: