Target
Prothrombin
Ligand
BDBM50147046
Substrate
Meas. Tech.
ChEBML_209098
Ki
>50000±n/a nM
Citation
 Subasinghe, NLAli, FIllig, CRJonathan Rudolph, MKlein, SKhalil, ESoll, RMBone, RFSpurlino, JCDesJarlais, RLCrysler, CSCummings, MDMorris, PEKilpatrick, JMSudhakara Babu, Y A novel series of potent and selective small molecule inhibitors of the complement component C1s. Bioorg Med Chem Lett 14:3043-7 (2004)  
Target
Name:
Prothrombin
Synonyms:
Activation peptide fragment 1 Coagulation factor II Prothrombin precursor Thrombin heavy chain | Thrombin light chain
Type:
Protein
Mol. Mass.:
70029.57
Organism:
Homo sapiens (Human)
Description:
P00734
Residue:
622
  
Inhibitor
Name:
BDBM50147046
Synonyms:
5-Methylsulfanyl-4-[4-(5-propoxy-1-pyridin-2-yl-1H-pyrazol-4-yl)-thiazol-2-yl]-thiophene-2-carboxamidine | CHEMBL317917
Type:
Small organic molecule
Emp. Form.:
C20H20N6OS3
Mol. Mass.:
456.607
SMILES:
CCCOc1c(cnn1-c1ccccn1)-c1csc(n1)-c1cc(sc1SC)C(N)=N
: