Target
Protein arginine N-methyltransferase 8
Ligand
BDBM178103
Substrate
Meas. Tech.
ChEMBL_2146492 (CHEMBL5030838)
IC50
4.0±n/a nM
Citation
 Shen, YLi, FSzewczyk, MMHalabelian, LChau, IEram, MSDela Seña, CPark, KSMeng, FChen, HZeng, HDong, AWu, HTrush, VVMcLeod, DZepeda-Velázquez, CACampbell, RMMader, MMWatson, BMSchapira, MArrowsmith, CHAl-Awar, RBarsyte-Lovejoy, DKaniskan, HÜBrown, PJVedadi, MJin, J A First-in-Class, Highly Selective and Cell-Active Allosteric Inhibitor of Protein Arginine Methyltransferase 6. J Med Chem 64:3697-3706 (2021)  
Target
Name:
Protein arginine N-methyltransferase 8
Synonyms:
ANM8_HUMAN HRMT1L3 Heterogeneous nuclear ribonucleoprotein methyltransferase-like protein 4 Protein arginine N-methyltransferase 8 Protein arginine methyltransferase 8 (PRMT8)
Type:
Protein
Mol. Mass.:
45293.70
Organism:
Homo sapiens (Human)
Description:
Residue:
394
  
Inhibitor
Name:
BDBM178103
Synonyms:
MS023 (Compound 3) | N1-((4-(4-isopropoxyphenyl)-1H-pyrrol-3-yl)methyl)-N1-methylethane-1,2-diamine
Type:
Small organic molecule
Emp. Form.:
C17H25N3O
Mol. Mass.:
287.3999
SMILES:
CC(C)Oc1ccc(cc1)-c1c[nH]cc1CN(C)CCN
: