Target
Beta-secretase 1
Ligand
BDBM50580216
Substrate
Meas. Tech.
ChEMBL_2147515 (CHEMBL5031861)
Ki
0.400000±n/a nM
Citation
 Ueno, TMatsuoka, EAsada, NYamamoto, SKanegawa, NIto, MIto, HMoechars, DRombouts, FJRGijsen, HJMKusakabe, KI Discovery of Extremely Selective Fused Pyridine-Derived ?-Site Amyloid Precursor Protein-Cleaving Enzyme (BACE1) Inhibitors with High In Vivo Efficacy through 10s Loop Interactions. J Med Chem 64:14165-14174 (2021)  
Target
Name:
Beta-secretase 1
Synonyms:
ASP2 Aspartyl protease 2 BACE1 Beta-secretase (BACE) Beta-secretase 1 (BACE 1) Beta-secretase 1 (BACE1) Beta-site amyloid precursor protein cleaving enzyme 1 Memapsin-2 beta-Secretase (BACE-1) | beta-Secretase (BACE1)
Type:
Protein
Mol. Mass.:
55755.10
Organism:
Homo sapiens (Human)
Description:
P56817
Residue:
501
  
Inhibitor
Name:
BDBM50580216
Synonyms:
MK-8931 SCH-900931 VERUBECESTAT | Verubecestat
Type:
Small organic molecule
Emp. Form.:
C17H17F2N5O3S
Mol. Mass.:
409.41
SMILES:
CN1C(N)=N[C@@](C)(CS1(=O)=O)c1cc(NC(=O)c2ccc(F)cn2)ccc1F
: